{"text_format":"3","workbook":"xlsx","n_sheets":4,"sheets":["Barosheet","Bar_FMP","Stand Dashboard","Valsalva Dashboard"],"not_rendered":{"charts":8,"images":28,"defined_names":1},"read":"whole","date_system":"1900"}

{"sheet":"Barosheet","index":0,"n_rows":187,"n_cols":26,"rows_kept":187}
[]
["Code (not the name):",null,null,"Age (years):",null,null,"Lab ID"]
["Visit:"]
[]
[]
["Position/comments","Time","SBP","MBP","DBP","HR"]
["Flat ","min","mmHg","mmHg","mmHg","bpm"]
[null,{"$f":"B9-1","v":-29}]
[null,-28]
[null,-27]
[null,-26]
[null,-25]
[null,-24]
[null,-23]
[null,-22]
[null,-21]
[null,{"$f":"B18-1","v":-20}]
[null,-19,"SBP","MBP","DBP","HR",{"$nulls":3},"HRV","SP MCA","MCA  Mean ","PI "]
["Flat ",-18,"mmHg","mmHg","mmHg","bpm",{"$nulls":3},"bpm ","cm/s","cm/s"]
[null,-17,{"$nulls":5},{"$f":"$C20-$E20","v":0},{"$f":"$H20/3","v":0}]
[null,-16,{"$nulls":5},0,0]
[null,-15,{"$nulls":5},0,0]
[null,-14,{"$nulls":5},0,0]
["deep paced breathing ",{"$f":"B25-1","v":-13},{"$nulls":5},0,0]
["deep paced breathing ",-12,{"$nulls":5},0,0]
["deep paced breathing ",-11,{"$nulls":5},0,0]
["deep paced breathing ",-10,{"$nulls":5},0,0]
[null,-9,{"$nulls":5},0,0]
[null,-8,{"$nulls":5},0,0]
[null,-7,{"$nulls":5},0,0]
[null,-6,{"$nulls":5},0,0]
[null,-5,{"$nulls":5},0,0]
[null,-4,{"$nulls":5},0,0]
[null,-3,{"$nulls":5},0,0]
[null,{"$f":"B36-1","v":-2},{"$nulls":5},0,0]
[null,-1,{"$nulls":5},0,0]
["Head-up tilt",{"$nulls":5},"HR/SBP",{"$nulls":6},"SBP","DPB","HR"]
[null,0,{"$nulls":4},{"$f":"(F38-$F$36)/(C38-$C$36)","v":{"$error":"#DIV/0!"}},{"$f":"$C38-$E38","v":0},{"$f":"$H38/3","v":0},{"$nulls":4},{"$f":"$C$36-C38","v":0},{"$f":"$E$36-E38","v":0},{"$f":"F38-$F$36","v":0}]
[null,{"$f":"B38+1","v":1},{"$nulls":4},{"$f":"(F39-$F$36)/(C39-$C$36)","v":{"$error":"#DIV/0!"}},0,0,{"$nulls":4},0,0,0]
[null,{"$f":"B39+1","v":2},{"$nulls":4},{"$error":"#DIV/0!"},0,0,{"$nulls":4},0,0,0]
[null,3,{"$nulls":4},{"$error":"#DIV/0!"},0,0,{"$nulls":4},0,0,0]
[null,4,{"$nulls":4},{"$error":"#DIV/0!"},0,0,{"$nulls":4},0,0,0]
[null,5,{"$nulls":4},{"$error":"#DIV/0!"},0,0,{"$nulls":4},0,0,0]
[null,6,{"$nulls":4},{"$error":"#DIV/0!"},0,0,{"$nulls":4},0,0,0]
[null,7,{"$nulls":4},{"$error":"#DIV/0!"},0,0,{"$nulls":4},0,0,0]
[null,8,{"$nulls":4},{"$error":"#DIV/0!"},0,0,{"$nulls":4},0,0,0]
[null,9,{"$nulls":4},{"$error":"#DIV/0!"},0,0,{"$nulls":4},0,0,0]
[null,10,{"$nulls":4},{"$error":"#DIV/0!"},0,0,{"$nulls":4},0,0,0]
[null,11,{"$nulls":4},{"$error":"#DIV/0!"},0,0,{"$nulls":4},0,0,0]
[null,12,{"$nulls":4},{"$error":"#DIV/0!"},0,0,{"$nulls":4},0,0,0]
[null,14,{"$nulls":4},{"$error":"#DIV/0!"},0,0,{"$nulls":4},0,0,0]
[null,15,{"$nulls":4},{"$error":"#DIV/0!"},0,0,{"$nulls":4},0,0,0]
[null,16,{"$nulls":4},{"$error":"#DIV/0!"},0,0,{"$nulls":4},0,0,0]
[null,17,{"$nulls":4},{"$error":"#DIV/0!"},0,0,{"$nulls":4},0,0,0]
[null,18,{"$nulls":4},{"$error":"#DIV/0!"},0,0,{"$nulls":4},0,0,0]
[null,19,{"$nulls":4},{"$error":"#DIV/0!"},0,0,{"$nulls":4},0,0,0]
[null,20,{"$nulls":4},{"$error":"#DIV/0!"},0,0,{"$nulls":4},0,0,0]
[null,21,{"$nulls":4},{"$error":"#DIV/0!"},0,0,{"$nulls":4},0,0,0]
[null,22,{"$nulls":4},{"$error":"#DIV/0!"},0,0,{"$nulls":4},0,0,0]
[null,23,{"$nulls":4},{"$error":"#DIV/0!"},0,0,{"$nulls":4},0,0,0]
[null,24,{"$nulls":4},{"$error":"#DIV/0!"},0,0,{"$nulls":4},0,0,0]
[null,25,{"$nulls":4},{"$error":"#DIV/0!"},0,0,{"$nulls":4},0,0,0]
[null,26,{"$nulls":4},{"$error":"#DIV/0!"},0,0,{"$nulls":4},0,0,0]
[null,27,{"$nulls":4},{"$error":"#DIV/0!"},0,0,{"$nulls":4},0,0,0]
[null,28,{"$nulls":4},{"$error":"#DIV/0!"},0,0,{"$nulls":4},0,0,0]
[null,29,{"$nulls":4},{"$error":"#DIV/0!"},0,0]
[null,30,{"$nulls":4},{"$error":"#DIV/0!"},0,0]
[null,31,{"$nulls":4},{"$error":"#DIV/0!"},0,0]
[null,32,{"$nulls":4},{"$error":"#DIV/0!"},0,0]
[null,33,{"$nulls":4},{"$error":"#DIV/0!"},0,0]
[null,34,{"$nulls":4},{"$error":"#DIV/0!"},0,0]
[null,35,{"$nulls":4},{"$error":"#DIV/0!"},0,0]
[null,36,{"$nulls":4},{"$error":"#DIV/0!"},0,0]
[null,37,{"$nulls":4},{"$error":"#DIV/0!"},0,0]
[null,38,{"$nulls":4},{"$error":"#DIV/0!"},0,0]
[null,39,{"$nulls":4},{"$error":"#DIV/0!"},0,0]
[null,40,{"$nulls":4},{"$error":"#DIV/0!"},0,0]
[null,41,{"$nulls":4},{"$error":"#DIV/0!"},0,0,{"$nulls":4},0,0,0]
[null,42,{"$nulls":4},{"$error":"#DIV/0!"},0,0,{"$nulls":4},0,0,0]
["Return flat "]
[null,1,{"$nulls":5},{"$f":"$C81-$E81","v":0},{"$f":"$H81/3","v":0}]
[null,2,{"$nulls":5},{"$f":"$C82-$E82","v":0},{"$f":"$H82/3","v":0}]
[null,3,{"$nulls":5},0,0]
[null,4,{"$nulls":5},0,0]
[null,5,{"$nulls":5},0,0]
["Sitting "]
[null,1,{"$nulls":5},{"$f":"$C87-$E87","v":0},{"$f":"$H87/3","v":0}]
[null,2,{"$nulls":5},0,0]
["Sitting"]
[]
[]
[]
[]
[{"$nulls":19},"Valsalva Maneuver Sitting "]
[]
[{"$nulls":18},"Position/comments","Time","SBP","DBP","HR","HRV","PS ","M-CBF "]
[{"$nulls":18},"Sitting ","Seconds","mmHg","mmHg","bpm","bpm","cm/s","cm/s"]
[{"$nulls":19},10]
[{"$nulls":19},20]
[{"$nulls":19},30]
[{"$nulls":19},40]
[{"$nulls":18},"Baseline",50]
[{"$nulls":18},"phase I ",60]
[{"$nulls":18},"phase II early ",70]
[{"$nulls":18},"phase II late ",80]
[{"$nulls":18},"phase IV (overshoot) ",90]
[{"$nulls":19},100]
[{"$nulls":19},110]
[{"$nulls":19},120]
[{"$nulls":19},130]
[{"$nulls":7},"Average supine","SBP","DBP","MBP","HR",{"$nulls":6},"Baseline",140]
[{"$nulls":7},"Average supine","SBP","DBP","MBP","HR",{"$nulls":6},"phase I ",150]
[{"$nulls":7},"Values",{"$f":"AVERAGE(C20:C36)","v":{"$error":"#DIV/0!"}},{"$f":"AVERAGE(E20:E36)","v":{"$error":"#DIV/0!"}},{"$f":"AVERAGE(D20:D36)","v":{"$error":"#DIV/0!"}},{"$f":"AVERAGE(F20:F36)","v":{"$error":"#DIV/0!"}},{"$nulls":6},"phase II early ",160]
[{"$nulls":7},"Hypertensive stage",{"$nulls":10},"phase II late ",170]
[{"$nulls":18},"phase IV (overshoot) ",180]
[{"$nulls":7},"Average tilted","SBP","DBP","MBP","HR",{"$nulls":7},190]
[{"$nulls":7},"Average tilted","SBP","DBP","MBP","HR",{"$nulls":7},200]
[{"$nulls":7},"Values",{"$f":"AVERAGE(C38:C79)","v":{"$error":"#DIV/0!"}},{"$f":"AVERAGE(E38:E79)","v":{"$error":"#DIV/0!"}},{"$f":"AVERAGE(D38:D79)","v":{"$error":"#DIV/0!"}},{"$f":"AVERAGE(F38:F79)","v":{"$error":"#DIV/0!"}},{"$nulls":7},210]
[{"$nulls":19},220]
[{"$nulls":7},"HRV supine ","BPM ",{"$nulls":9},"Baseline",230]
[{"$nulls":7},"Values ",{"$f":"AVERAGE(J20:J36)","v":{"$error":"#DIV/0!"}},{"$nulls":4},"SBP","DBP","Hypertension stage",null,null,"phase I ",240]
[{"$nulls":7},"HRV tilted ","BPM ",{"$nulls":4},"< 130","< 85","Normal",null,null,"phase II early ",250]
[{"$nulls":7},"Values ",{"$f":"AVERAGE(J38:J79)","v":{"$error":"#DIV/0!"}},{"$nulls":4},"> 130","> 85","Borderline",null,null,"phase II late ",260]
[{"$nulls":13},"> 140","> 90",1,null,null,"phase IV (overshoot) ",270]
[{"$nulls":7},"DPBT HRV ","BPM ",{"$nulls":4},"> 160","> 100",2,{"$nulls":3},280]
[{"$nulls":7},"Values ",{"$f":"AVERAGE(J23:J28)","v":{"$error":"#DIV/0!"}},{"$nulls":4},"> 180","> 110",3,{"$nulls":3},290]
[{"$nulls":13},"> 210","> 120",4,{"$nulls":3},300]
[{"$nulls":7},"PSV supine ","cm/s",{"$nulls":10},310]
[{"$nulls":7},"Values ",{"$f":"AVERAGE(K20:K36)","v":{"$error":"#DIV/0!"}},{"$nulls":10},320]
[{"$nulls":19},330]
[{"$nulls":7},"M-CBF supine ","cm/s "]
[{"$nulls":7},"Values ",{"$f":"AVERAGE(L20:L36)","v":{"$error":"#DIV/0!"}}]
[]
[{"$nulls":7},"PSV tilted ","cm/s"]
[{"$nulls":7},"Values ",{"$f":"AVERAGE(K38:K79)","v":{"$error":"#DIV/0!"}},{"$nulls":4},9]
[]
[{"$nulls":7},"M-CBF tilted","cm/s "]
[{"$nulls":7},"Values ",{"$f":"AVERAGE(L38:L79)","v":{"$error":"#DIV/0!"}}]
[]
[{"$nulls":7},"PSV 2nd supine","cm/s"]
[{"$nulls":7},"Values ",{"$f":"AVERAGE(K81:K85)","v":{"$error":"#DIV/0!"}}]
[]
[{"$nulls":7},"M-CBF 2nd supine","cm/s "]
[{"$nulls":7},"Values ",{"$f":"AVERAGE(L81:L85)","v":{"$error":"#DIV/0!"}}]
[]
[]
[]
[]
[]
[]
["Additionally assesments "]
[]
["Tamizaje cognitivo (MoCA): "]
["/30 puntos "]
["UPSIT:  "]
["32/40 puntos"]
["MDS-UPDRS III:"]
["OFF"]
["OFF - glucosa "]
["ON "]
["ON - midodrine "]
["USG vesical "]
["pre-miccional= "]
["post-miccional= "]
["Termografia "]
["Reposo"]
["mano derecha "]
["mano izquierda"]
["pie derecho "]
["pie izquierdo "]
["Estímulo frío "]
["mano derecha "]
["mano izquierda"]
["Glucosa "]
["mano derecha "]
["mano izquierda"]
["Levodopa ON (si aplica)"]
["mano derecha "]
["mano izquierda"]
["Final - reposo "]
["mano derecha "]
["mano izquierda"]
["Sudoscan "]
["mano derecha "]
["mano izquierda"]
["pie derecho "]
["pie izquierdo "]

{"sheet":"Bar_FMP","index":1,"n_rows":2,"n_cols":65,"rows_kept":2}
["FileCode","supsys","supdia","supmean","suphr","time1","sys1","dia1","mean1","hr1","time3","sys3","dia3","mean3","hr3","time5","sys5","dia5","mean5","hr5","time10","sys10","dia10","mean10","hr10","time15","sys15","dia15","mean15","hr15","time20","sys20","dia20","mean20","hr20","time25","sys25","dia25","mean25","hr25","time30","sys30","dia30","mean30","hr30","time35","sys35","dia35","mean35","hr35","syslast","dialast","meanlast","hrlast","syslowSBP","dialowSBP","meanlowSBP","hrlowSBP","syslowDBP","dialowDBP","meanlowDBP","hrlowDBP","TimeLast","TimeLowSBP","TimeLowDBP"]
[{"$f":"Barosheet!#REF!","v":{"$error":"#REF!"}},{"$f":"Barosheet!#REF!","v":{"$error":"#REF!"}},{"$f":"Barosheet!#REF!","v":{"$error":"#REF!"}},{"$f":"Barosheet!#REF!","v":{"$error":"#REF!"}},1,{"$f":"Barosheet!#REF!","v":{"$error":"#REF!"}},{"$f":"Barosheet!#REF!","v":{"$error":"#REF!"}},{"$f":"Barosheet!#REF!","v":{"$error":"#REF!"}},{"$f":"Barosheet!#REF!","v":{"$error":"#REF!"}},3,{"$f":"Barosheet!#REF!","v":{"$error":"#REF!"}},{"$f":"Barosheet!#REF!","v":{"$error":"#REF!"}},{"$f":"Barosheet!#REF!","v":{"$error":"#REF!"}},{"$f":"Barosheet!#REF!","v":{"$error":"#REF!"}},5,{"$f":"Barosheet!#REF!","v":{"$error":"#REF!"}},{"$f":"Barosheet!#REF!","v":{"$error":"#REF!"}},{"$f":"Barosheet!#REF!","v":{"$error":"#REF!"}},{"$f":"Barosheet!#REF!","v":{"$error":"#REF!"}},10,{"$f":"Barosheet!#REF!","v":{"$error":"#REF!"}},{"$f":"Barosheet!#REF!","v":{"$error":"#REF!"}},{"$f":"Barosheet!#REF!","v":{"$error":"#REF!"}},{"$f":"Barosheet!#REF!","v":{"$error":"#REF!"}},{"$nulls":25},138,65,{"v":89.33333333333333,"d":"89"},90,123,69,87,100,145,40,75,96,14,11,9]

{"sheet":"Stand Dashboard","index":2,"n_rows":79,"n_cols":13,"rows_kept":79,"merged":[[0,0,0,12],[1,0,1,12],[3,7,3,8],[67,0,67,4],[74,0,74,4]]}
["BaroSheet — prolonged stand"]
["Visit notes (meds · meal · hydration)"]
[]
["Metric","Supine","Head-up tilt","Δ tilt − supine","Return flat","Sitting",null,"Highlights",null,"Phase colors"]
["SBP (mmHg)",{"$f":"Barosheet!I113","v":{"$error":"#DIV/0!"}},{"$f":"Barosheet!I118","v":{"$error":"#DIV/0!"}},{"$f":"C5-B5","v":{"$error":"#DIV/0!"}},{"$f":"AVERAGE(Barosheet!C81:C85)","v":{"$error":"#DIV/0!"}},{"$f":"AVERAGE(Barosheet!C87:C88)","v":{"$error":"#DIV/0!"}},null,"Nadir SBP on tilt (min 30)",{"$f":"Barosheet!C79","v":0},"Supine"]
["DBP (mmHg)",{"$f":"Barosheet!J113","v":{"$error":"#DIV/0!"}},{"$f":"Barosheet!J118","v":{"$error":"#DIV/0!"}},{"$error":"#DIV/0!"},{"$f":"AVERAGE(Barosheet!E81:E85)","v":{"$error":"#DIV/0!"}},{"$f":"AVERAGE(Barosheet!E87:E88)","v":{"$error":"#DIV/0!"}},null,"Nadir DBP on tilt (min 3)",{"$f":"Barosheet!E40","v":0},"Deep breathing"]
["MBP (mmHg)",{"$f":"Barosheet!K113","v":{"$error":"#DIV/0!"}},{"$f":"Barosheet!K118","v":{"$error":"#DIV/0!"}},{"$error":"#DIV/0!"},{"$f":"AVERAGE(Barosheet!D81:D85)","v":{"$error":"#DIV/0!"}},{"$f":"AVERAGE(Barosheet!D87:D88)","v":{"$error":"#DIV/0!"}},null,"Peak HR on tilt (min 30)",{"$f":"Barosheet!F79","v":0},"Tilt"]
["HR (bpm)",{"$f":"Barosheet!L113","v":{"$error":"#DIV/0!"}},{"$f":"Barosheet!L118","v":{"$error":"#DIV/0!"}},{"$error":"#DIV/0!"},{"$f":"AVERAGE(Barosheet!F81:F85)","v":{"$error":"#DIV/0!"}},{"$f":"AVERAGE(Barosheet!F87:F88)","v":{"$error":"#DIV/0!"}},null,"Peak HRV (return min 1)",{"$f":"Barosheet!J81","v":0},"Bathroom"]
["HRV (bpm)",{"$f":"Barosheet!I121","v":{"$error":"#DIV/0!"}},{"$f":"Barosheet!I123","v":{"$error":"#DIV/0!"}},{"$error":"#DIV/0!"},{"$f":"AVERAGE(Barosheet!J81:J85)","v":{"$error":"#DIV/0!"}},{"$f":"AVERAGE(Barosheet!J87:J88)","v":{"$error":"#DIV/0!"}},null,"Sitting SBP (min 1)",{"$f":"Barosheet!C87","v":0},"Return flat"]
["PSV / SP MCA (cm/s)",{"$f":"Barosheet!I129","v":{"$error":"#DIV/0!"}},{"$f":"Barosheet!I135","v":{"$error":"#DIV/0!"}},{"$error":"#DIV/0!"},{"$f":"Barosheet!I141","v":{"$error":"#DIV/0!"}},{"$f":"AVERAGE(Barosheet!K87:K88)","v":{"$error":"#DIV/0!"}},null,"Protocol points plotted",{"$f":"COUNTA(A14:A65)","v":52},"Sitting"]
["M-CBF (cm/s)",{"$f":"Barosheet!I132","v":{"$error":"#DIV/0!"}},{"$f":"Barosheet!I138","v":{"$error":"#DIV/0!"}},{"$error":"#DIV/0!"},{"$f":"Barosheet!I144","v":{"$error":"#DIV/0!"}},{"$f":"AVERAGE(Barosheet!L87:L88)","v":{"$error":"#DIV/0!"}},null,"Green = live formula to the BaroSheet tab"]
[]
["Minute","SBP","MBP","DBP","HR","HRV","PSV","M-CBF","Phase","Minute","PSV","M-CBF","HRV"]
[{"$f":"TEXT(Barosheet!B20,\"0\")","v":"-17"},{"$f":"Barosheet!C20","v":{"v":0,"d":"0.0"}},{"$f":"Barosheet!D20","v":{"v":0,"d":"0.0"}},{"$f":"Barosheet!E20","v":{"v":0,"d":"0.0"}},{"$f":"Barosheet!F20","v":{"v":0,"d":"0.0"}},{"$f":"Barosheet!J20","v":{"v":0,"d":"0.0"}},{"$f":"Barosheet!K20","v":{"v":0,"d":"0.0"}},{"$f":"Barosheet!L20","v":{"v":0,"d":"0.0"}},"Supine",{"$f":"A14","v":"-17"},{"$f":"G14","v":{"v":0,"d":"0.0"}},{"$f":"H14","v":{"v":0,"d":"0.0"}},{"$f":"F14","v":{"v":0,"d":"0.0"}}]
[{"$f":"TEXT(Barosheet!B21,\"0\")","v":"-16"},{"$f":"Barosheet!C21","v":{"v":0,"d":"0.0"}},{"$f":"Barosheet!D21","v":{"v":0,"d":"0.0"}},{"$f":"Barosheet!E21","v":{"v":0,"d":"0.0"}},{"$f":"Barosheet!F21","v":{"v":0,"d":"0.0"}},{"$f":"Barosheet!J21","v":{"v":0,"d":"0.0"}},{"$f":"Barosheet!K21","v":{"v":0,"d":"0.0"}},{"$f":"Barosheet!L21","v":{"v":0,"d":"0.0"}},"Supine","-16",{"v":0,"d":"0.0"},{"v":0,"d":"0.0"},{"v":0,"d":"0.0"}]
[{"$f":"TEXT(Barosheet!B22,\"0\")","v":"-15"},{"$f":"Barosheet!C22","v":{"v":0,"d":"0.0"}},{"$f":"Barosheet!D22","v":{"v":0,"d":"0.0"}},{"$f":"Barosheet!E22","v":{"v":0,"d":"0.0"}},{"$f":"Barosheet!F22","v":{"v":0,"d":"0.0"}},{"$f":"Barosheet!J22","v":{"v":0,"d":"0.0"}},{"$f":"Barosheet!K22","v":{"v":0,"d":"0.0"}},{"$f":"Barosheet!L22","v":{"v":0,"d":"0.0"}},"Supine","-15",{"v":0,"d":"0.0"},{"v":0,"d":"0.0"},{"v":0,"d":"0.0"}]
[{"$f":"TEXT(Barosheet!B23,\"0\")","v":"-14"},{"$f":"Barosheet!C23","v":{"v":0,"d":"0.0"}},{"$f":"Barosheet!D23","v":{"v":0,"d":"0.0"}},{"$f":"Barosheet!E23","v":{"v":0,"d":"0.0"}},{"$f":"Barosheet!F23","v":{"v":0,"d":"0.0"}},{"$f":"Barosheet!J23","v":{"v":0,"d":"0.0"}},{"$f":"Barosheet!K23","v":{"v":0,"d":"0.0"}},{"$f":"Barosheet!L23","v":{"v":0,"d":"0.0"}},"Supine","-14",{"v":0,"d":"0.0"},{"v":0,"d":"0.0"},{"v":0,"d":"0.0"}]
[{"$f":"TEXT(Barosheet!B24,\"0\")","v":"-13"},{"$f":"Barosheet!C24","v":{"v":0,"d":"0.0"}},{"$f":"Barosheet!D24","v":{"v":0,"d":"0.0"}},{"$f":"Barosheet!E24","v":{"v":0,"d":"0.0"}},{"$f":"Barosheet!F24","v":{"v":0,"d":"0.0"}},{"$f":"Barosheet!J24","v":{"v":0,"d":"0.0"}},{"$f":"Barosheet!K24","v":{"v":0,"d":"0.0"}},{"$f":"Barosheet!L24","v":{"v":0,"d":"0.0"}},"Deep breathing","-13",{"v":0,"d":"0.0"},{"v":0,"d":"0.0"},{"v":0,"d":"0.0"}]
[{"$f":"TEXT(Barosheet!B25,\"0\")","v":"-12"},{"$f":"Barosheet!C25","v":{"v":0,"d":"0.0"}},{"$f":"Barosheet!D25","v":{"v":0,"d":"0.0"}},{"$f":"Barosheet!E25","v":{"v":0,"d":"0.0"}},{"$f":"Barosheet!F25","v":{"v":0,"d":"0.0"}},{"$f":"Barosheet!J25","v":{"v":0,"d":"0.0"}},{"$f":"Barosheet!K25","v":{"v":0,"d":"0.0"}},{"$f":"Barosheet!L25","v":{"v":0,"d":"0.0"}},"Deep breathing","-12",{"v":0,"d":"0.0"},{"v":0,"d":"0.0"},{"v":0,"d":"0.0"}]
[{"$f":"TEXT(Barosheet!B26,\"0\")","v":"-11"},{"$f":"Barosheet!C26","v":{"v":0,"d":"0.0"}},{"$f":"Barosheet!D26","v":{"v":0,"d":"0.0"}},{"$f":"Barosheet!E26","v":{"v":0,"d":"0.0"}},{"$f":"Barosheet!F26","v":{"v":0,"d":"0.0"}},{"$f":"Barosheet!J26","v":{"v":0,"d":"0.0"}},{"$f":"Barosheet!K26","v":{"v":0,"d":"0.0"}},{"$f":"Barosheet!L26","v":{"v":0,"d":"0.0"}},"Deep breathing","-11",{"v":0,"d":"0.0"},{"v":0,"d":"0.0"},{"v":0,"d":"0.0"}]
[{"$f":"TEXT(Barosheet!B27,\"0\")","v":"-10"},{"$f":"Barosheet!C27","v":{"v":0,"d":"0.0"}},{"$f":"Barosheet!D27","v":{"v":0,"d":"0.0"}},{"$f":"Barosheet!E27","v":{"v":0,"d":"0.0"}},{"$f":"Barosheet!F27","v":{"v":0,"d":"0.0"}},{"$f":"Barosheet!J27","v":{"v":0,"d":"0.0"}},{"$f":"Barosheet!K27","v":{"v":0,"d":"0.0"}},{"$f":"Barosheet!L27","v":{"v":0,"d":"0.0"}},"Deep breathing","-10",{"v":0,"d":"0.0"},{"v":0,"d":"0.0"},{"v":0,"d":"0.0"}]
[{"$f":"TEXT(Barosheet!B28,\"0\")","v":"-9"},{"$f":"Barosheet!C28","v":{"v":0,"d":"0.0"}},{"$f":"Barosheet!D28","v":{"v":0,"d":"0.0"}},{"$f":"Barosheet!E28","v":{"v":0,"d":"0.0"}},{"$f":"Barosheet!F28","v":{"v":0,"d":"0.0"}},{"$f":"Barosheet!J28","v":{"v":0,"d":"0.0"}},{"$f":"Barosheet!K28","v":{"v":0,"d":"0.0"}},{"$f":"Barosheet!L28","v":{"v":0,"d":"0.0"}},"Supine","-9",{"v":0,"d":"0.0"},{"v":0,"d":"0.0"},{"v":0,"d":"0.0"}]
[{"$f":"TEXT(Barosheet!B29,\"0\")","v":"-8"},{"$f":"Barosheet!C29","v":{"v":0,"d":"0.0"}},{"$f":"Barosheet!D29","v":{"v":0,"d":"0.0"}},{"$f":"Barosheet!E29","v":{"v":0,"d":"0.0"}},{"$f":"Barosheet!F29","v":{"v":0,"d":"0.0"}},{"$f":"Barosheet!J29","v":{"v":0,"d":"0.0"}},{"$f":"Barosheet!K29","v":{"v":0,"d":"0.0"}},{"$f":"Barosheet!L29","v":{"v":0,"d":"0.0"}},"Supine","-8",{"v":0,"d":"0.0"},{"v":0,"d":"0.0"},{"v":0,"d":"0.0"}]
[{"$f":"TEXT(Barosheet!B30,\"0\")","v":"-7"},{"$f":"Barosheet!C30","v":{"v":0,"d":"0.0"}},{"$f":"Barosheet!D30","v":{"v":0,"d":"0.0"}},{"$f":"Barosheet!E30","v":{"v":0,"d":"0.0"}},{"$f":"Barosheet!F30","v":{"v":0,"d":"0.0"}},{"$f":"Barosheet!J30","v":{"v":0,"d":"0.0"}},{"$f":"Barosheet!K30","v":{"v":0,"d":"0.0"}},{"$f":"Barosheet!L30","v":{"v":0,"d":"0.0"}},"Supine","-7",{"v":0,"d":"0.0"},{"v":0,"d":"0.0"},{"v":0,"d":"0.0"}]
[{"$f":"TEXT(Barosheet!B31,\"0\")","v":"-6"},{"$f":"Barosheet!C31","v":{"v":0,"d":"0.0"}},{"$f":"Barosheet!D31","v":{"v":0,"d":"0.0"}},{"$f":"Barosheet!E31","v":{"v":0,"d":"0.0"}},{"$f":"Barosheet!F31","v":{"v":0,"d":"0.0"}},{"$f":"Barosheet!J31","v":{"v":0,"d":"0.0"}},{"$f":"Barosheet!K31","v":{"v":0,"d":"0.0"}},{"$f":"Barosheet!L31","v":{"v":0,"d":"0.0"}},"Supine","-6",{"v":0,"d":"0.0"},{"v":0,"d":"0.0"},{"v":0,"d":"0.0"}]
[{"$f":"TEXT(Barosheet!B32,\"0\")","v":"-5"},{"$f":"Barosheet!C32","v":{"v":0,"d":"0.0"}},{"$f":"Barosheet!D32","v":{"v":0,"d":"0.0"}},{"$f":"Barosheet!E32","v":{"v":0,"d":"0.0"}},{"$f":"Barosheet!F32","v":{"v":0,"d":"0.0"}},{"$f":"Barosheet!J32","v":{"v":0,"d":"0.0"}},{"$f":"Barosheet!K32","v":{"v":0,"d":"0.0"}},{"$f":"Barosheet!L32","v":{"v":0,"d":"0.0"}},"Supine","-5",{"v":0,"d":"0.0"},{"v":0,"d":"0.0"},{"v":0,"d":"0.0"}]
[{"$f":"TEXT(Barosheet!B33,\"0\")","v":"-4"},{"$f":"Barosheet!C33","v":{"v":0,"d":"0.0"}},{"$f":"Barosheet!D33","v":{"v":0,"d":"0.0"}},{"$f":"Barosheet!E33","v":{"v":0,"d":"0.0"}},{"$f":"Barosheet!F33","v":{"v":0,"d":"0.0"}},{"$f":"Barosheet!J33","v":{"v":0,"d":"0.0"}},{"$f":"Barosheet!K33","v":{"v":0,"d":"0.0"}},{"$f":"Barosheet!L33","v":{"v":0,"d":"0.0"}},"Supine","-4",{"v":0,"d":"0.0"},{"v":0,"d":"0.0"},{"v":0,"d":"0.0"}]
[{"$f":"TEXT(Barosheet!B34,\"0\")","v":"-3"},{"$f":"Barosheet!C34","v":{"v":0,"d":"0.0"}},{"$f":"Barosheet!D34","v":{"v":0,"d":"0.0"}},{"$f":"Barosheet!E34","v":{"v":0,"d":"0.0"}},{"$f":"Barosheet!F34","v":{"v":0,"d":"0.0"}},{"$f":"Barosheet!J34","v":{"v":0,"d":"0.0"}},{"$f":"Barosheet!K34","v":{"v":0,"d":"0.0"}},{"$f":"Barosheet!L34","v":{"v":0,"d":"0.0"}},"Supine","-3",{"v":0,"d":"0.0"},{"v":0,"d":"0.0"},{"v":0,"d":"0.0"}]
[{"$f":"TEXT(Barosheet!B35,\"0\")","v":"-2"},{"$f":"Barosheet!C35","v":{"v":0,"d":"0.0"}},{"$f":"Barosheet!D35","v":{"v":0,"d":"0.0"}},{"$f":"Barosheet!E35","v":{"v":0,"d":"0.0"}},{"$f":"Barosheet!F35","v":{"v":0,"d":"0.0"}},{"$f":"Barosheet!J35","v":{"v":0,"d":"0.0"}},{"$f":"Barosheet!K35","v":{"v":0,"d":"0.0"}},{"$f":"Barosheet!L35","v":{"v":0,"d":"0.0"}},"Supine","-2",{"v":0,"d":"0.0"},{"v":0,"d":"0.0"},{"v":0,"d":"0.0"}]
[{"$f":"TEXT(Barosheet!B36,\"0\")","v":"-1"},{"$f":"Barosheet!C36","v":{"v":0,"d":"0.0"}},{"$f":"Barosheet!D36","v":{"v":0,"d":"0.0"}},{"$f":"Barosheet!E36","v":{"v":0,"d":"0.0"}},{"$f":"Barosheet!F36","v":{"v":0,"d":"0.0"}},{"$f":"Barosheet!J36","v":{"v":0,"d":"0.0"}},{"$f":"Barosheet!K36","v":{"v":0,"d":"0.0"}},{"$f":"Barosheet!L36","v":{"v":0,"d":"0.0"}},"Supine","-1",{"v":0,"d":"0.0"},{"v":0,"d":"0.0"},{"v":0,"d":"0.0"}]
[{"$f":"\"T\"&Barosheet!B38","v":"T0"},{"$f":"Barosheet!C38","v":{"v":0,"d":"0.0"}},{"$f":"Barosheet!D38","v":{"v":0,"d":"0.0"}},{"$f":"Barosheet!E38","v":{"v":0,"d":"0.0"}},{"$f":"Barosheet!F38","v":{"v":0,"d":"0.0"}},{"$f":"Barosheet!J38","v":{"v":0,"d":"0.0"}},{"$f":"Barosheet!K38","v":{"v":0,"d":"0.0"}},{"$f":"Barosheet!L38","v":{"v":0,"d":"0.0"}},"Tilt","T0",{"v":0,"d":"0.0"},{"v":0,"d":"0.0"},{"v":0,"d":"0.0"}]
[{"$f":"\"T\"&Barosheet!B39","v":"T1"},{"$f":"Barosheet!C39","v":{"v":0,"d":"0.0"}},{"$f":"Barosheet!D39","v":{"v":0,"d":"0.0"}},{"$f":"Barosheet!E39","v":{"v":0,"d":"0.0"}},{"$f":"Barosheet!F39","v":{"v":0,"d":"0.0"}},{"$f":"Barosheet!J39","v":{"v":0,"d":"0.0"}},{"$f":"Barosheet!K39","v":{"v":0,"d":"0.0"}},{"$f":"Barosheet!L39","v":{"v":0,"d":"0.0"}},"Tilt","T1",{"v":0,"d":"0.0"},{"v":0,"d":"0.0"},{"v":0,"d":"0.0"}]
[{"$f":"\"T\"&Barosheet!B40","v":"T2"},{"$f":"Barosheet!C40","v":{"v":0,"d":"0.0"}},{"$f":"Barosheet!D40","v":{"v":0,"d":"0.0"}},{"$f":"Barosheet!E40","v":{"v":0,"d":"0.0"}},{"$f":"Barosheet!F40","v":{"v":0,"d":"0.0"}},{"$f":"Barosheet!J40","v":{"v":0,"d":"0.0"}},{"$f":"Barosheet!K40","v":{"v":0,"d":"0.0"}},{"$f":"Barosheet!L40","v":{"v":0,"d":"0.0"}},"Tilt","T2",{"v":0,"d":"0.0"},{"v":0,"d":"0.0"},{"v":0,"d":"0.0"}]
[{"$f":"\"T\"&Barosheet!B41","v":"T3"},{"$f":"Barosheet!C41","v":{"v":0,"d":"0.0"}},{"$f":"Barosheet!D41","v":{"v":0,"d":"0.0"}},{"$f":"Barosheet!E41","v":{"v":0,"d":"0.0"}},{"$f":"Barosheet!F41","v":{"v":0,"d":"0.0"}},{"$f":"Barosheet!J41","v":{"v":0,"d":"0.0"}},{"$f":"Barosheet!K41","v":{"v":0,"d":"0.0"}},{"$f":"Barosheet!L41","v":{"v":0,"d":"0.0"}},"Tilt","T3",{"v":0,"d":"0.0"},{"v":0,"d":"0.0"},{"v":0,"d":"0.0"}]
[{"$f":"\"T\"&Barosheet!B42","v":"T4"},{"$f":"Barosheet!C42","v":{"v":0,"d":"0.0"}},{"$f":"Barosheet!D42","v":{"v":0,"d":"0.0"}},{"$f":"Barosheet!E42","v":{"v":0,"d":"0.0"}},{"$f":"Barosheet!F42","v":{"v":0,"d":"0.0"}},{"$f":"Barosheet!J42","v":{"v":0,"d":"0.0"}},{"$f":"Barosheet!K42","v":{"v":0,"d":"0.0"}},{"$f":"Barosheet!L42","v":{"v":0,"d":"0.0"}},"Tilt","T4",{"v":0,"d":"0.0"},{"v":0,"d":"0.0"},{"v":0,"d":"0.0"}]
[{"$f":"\"T\"&Barosheet!B43","v":"T5"},{"$f":"Barosheet!C43","v":{"v":0,"d":"0.0"}},{"$f":"Barosheet!D43","v":{"v":0,"d":"0.0"}},{"$f":"Barosheet!E43","v":{"v":0,"d":"0.0"}},{"$f":"Barosheet!F43","v":{"v":0,"d":"0.0"}},{"$f":"Barosheet!J43","v":{"v":0,"d":"0.0"}},{"$f":"Barosheet!K43","v":{"v":0,"d":"0.0"}},{"$f":"Barosheet!L43","v":{"v":0,"d":"0.0"}},"Tilt","T5",{"v":0,"d":"0.0"},{"v":0,"d":"0.0"},{"v":0,"d":"0.0"}]
[{"$f":"\"T\"&Barosheet!B44","v":"T6"},{"$f":"Barosheet!C44","v":{"v":0,"d":"0.0"}},{"$f":"Barosheet!D44","v":{"v":0,"d":"0.0"}},{"$f":"Barosheet!E44","v":{"v":0,"d":"0.0"}},{"$f":"Barosheet!F44","v":{"v":0,"d":"0.0"}},{"$f":"Barosheet!J44","v":{"v":0,"d":"0.0"}},{"$f":"Barosheet!K44","v":{"v":0,"d":"0.0"}},{"$f":"Barosheet!L44","v":{"v":0,"d":"0.0"}},"Tilt","T6",{"v":0,"d":"0.0"},{"v":0,"d":"0.0"},{"v":0,"d":"0.0"}]
[{"$f":"\"T\"&Barosheet!B45","v":"T7"},{"$f":"Barosheet!C45","v":{"v":0,"d":"0.0"}},{"$f":"Barosheet!D45","v":{"v":0,"d":"0.0"}},{"$f":"Barosheet!E45","v":{"v":0,"d":"0.0"}},{"$f":"Barosheet!F45","v":{"v":0,"d":"0.0"}},{"$f":"Barosheet!J45","v":{"v":0,"d":"0.0"}},{"$f":"Barosheet!K45","v":{"v":0,"d":"0.0"}},{"$f":"Barosheet!L45","v":{"v":0,"d":"0.0"}},"Tilt","T7",{"v":0,"d":"0.0"},{"v":0,"d":"0.0"},{"v":0,"d":"0.0"}]
[{"$f":"\"T\"&Barosheet!B46","v":"T8"},{"$f":"Barosheet!C46","v":{"v":0,"d":"0.0"}},{"$f":"Barosheet!D46","v":{"v":0,"d":"0.0"}},{"$f":"Barosheet!E46","v":{"v":0,"d":"0.0"}},{"$f":"Barosheet!F46","v":{"v":0,"d":"0.0"}},{"$f":"Barosheet!J46","v":{"v":0,"d":"0.0"}},{"$f":"Barosheet!K46","v":{"v":0,"d":"0.0"}},{"$f":"Barosheet!L46","v":{"v":0,"d":"0.0"}},"Tilt","T8",{"v":0,"d":"0.0"},{"v":0,"d":"0.0"},{"v":0,"d":"0.0"}]
[{"$f":"\"T\"&Barosheet!B47","v":"T9"},{"$f":"Barosheet!C47","v":{"v":0,"d":"0.0"}},{"$f":"Barosheet!D47","v":{"v":0,"d":"0.0"}},{"$f":"Barosheet!E47","v":{"v":0,"d":"0.0"}},{"$f":"Barosheet!F47","v":{"v":0,"d":"0.0"}},{"$f":"Barosheet!J47","v":{"v":0,"d":"0.0"}},{"$f":"Barosheet!K47","v":{"v":0,"d":"0.0"}},{"$f":"Barosheet!L47","v":{"v":0,"d":"0.0"}},"Tilt","T9",{"v":0,"d":"0.0"},{"v":0,"d":"0.0"},{"v":0,"d":"0.0"}]
[{"$f":"\"T\"&Barosheet!B48","v":"T10"},{"$f":"Barosheet!C48","v":{"v":0,"d":"0.0"}},{"$f":"Barosheet!D48","v":{"v":0,"d":"0.0"}},{"$f":"Barosheet!E48","v":{"v":0,"d":"0.0"}},{"$f":"Barosheet!F48","v":{"v":0,"d":"0.0"}},{"$f":"Barosheet!J48","v":{"v":0,"d":"0.0"}},{"$f":"Barosheet!K48","v":{"v":0,"d":"0.0"}},{"$f":"Barosheet!L48","v":{"v":0,"d":"0.0"}},"Bathroom","T10",{"v":0,"d":"0.0"},{"v":0,"d":"0.0"},{"v":0,"d":"0.0"}]
[{"$f":"\"T\"&Barosheet!B49","v":"T11"},{"$f":"Barosheet!C49","v":{"v":0,"d":"0.0"}},{"$f":"Barosheet!D49","v":{"v":0,"d":"0.0"}},{"$f":"Barosheet!E49","v":{"v":0,"d":"0.0"}},{"$f":"Barosheet!F49","v":{"v":0,"d":"0.0"}},{"$f":"Barosheet!J49","v":{"v":0,"d":"0.0"}},{"$f":"Barosheet!K49","v":{"v":0,"d":"0.0"}},{"$f":"Barosheet!L49","v":{"v":0,"d":"0.0"}},"Tilt","T11",{"v":0,"d":"0.0"},{"v":0,"d":"0.0"},{"v":0,"d":"0.0"}]
[{"$f":"\"T\"&Barosheet!B50","v":"T12"},{"$f":"Barosheet!C50","v":{"v":0,"d":"0.0"}},{"$f":"Barosheet!D50","v":{"v":0,"d":"0.0"}},{"$f":"Barosheet!E50","v":{"v":0,"d":"0.0"}},{"$f":"Barosheet!F50","v":{"v":0,"d":"0.0"}},{"$f":"Barosheet!J50","v":{"v":0,"d":"0.0"}},{"$f":"Barosheet!K50","v":{"v":0,"d":"0.0"}},{"$f":"Barosheet!L50","v":{"v":0,"d":"0.0"}},"Tilt","T12",{"v":0,"d":"0.0"},{"v":0,"d":"0.0"},{"v":0,"d":"0.0"}]
[{"$f":"\"T\"&Barosheet!B51","v":"T14"},{"$f":"Barosheet!C51","v":{"v":0,"d":"0.0"}},{"$f":"Barosheet!D51","v":{"v":0,"d":"0.0"}},{"$f":"Barosheet!E51","v":{"v":0,"d":"0.0"}},{"$f":"Barosheet!F51","v":{"v":0,"d":"0.0"}},{"$f":"Barosheet!J51","v":{"v":0,"d":"0.0"}},{"$f":"Barosheet!K51","v":{"v":0,"d":"0.0"}},{"$f":"Barosheet!L51","v":{"v":0,"d":"0.0"}},"Tilt","T14",{"v":0,"d":"0.0"},{"v":0,"d":"0.0"},{"v":0,"d":"0.0"}]
[{"$f":"\"T\"&Barosheet!B52","v":"T15"},{"$f":"Barosheet!C52","v":{"v":0,"d":"0.0"}},{"$f":"Barosheet!D52","v":{"v":0,"d":"0.0"}},{"$f":"Barosheet!E52","v":{"v":0,"d":"0.0"}},{"$f":"Barosheet!F52","v":{"v":0,"d":"0.0"}},{"$f":"Barosheet!J52","v":{"v":0,"d":"0.0"}},{"$f":"Barosheet!K52","v":{"v":0,"d":"0.0"}},{"$f":"Barosheet!L52","v":{"v":0,"d":"0.0"}},"Tilt","T15",{"v":0,"d":"0.0"},{"v":0,"d":"0.0"},{"v":0,"d":"0.0"}]
[{"$f":"\"T\"&Barosheet!B53","v":"T16"},{"$f":"Barosheet!C53","v":{"v":0,"d":"0.0"}},{"$f":"Barosheet!D53","v":{"v":0,"d":"0.0"}},{"$f":"Barosheet!E53","v":{"v":0,"d":"0.0"}},{"$f":"Barosheet!F53","v":{"v":0,"d":"0.0"}},{"$f":"Barosheet!J53","v":{"v":0,"d":"0.0"}},{"$f":"Barosheet!K53","v":{"v":0,"d":"0.0"}},{"$f":"Barosheet!L53","v":{"v":0,"d":"0.0"}},"Tilt",{"$f":"A46","v":"T16"},{"$f":"G46","v":{"v":0,"d":"0.0"}},{"$f":"H46","v":{"v":0,"d":"0.0"}},{"$f":"F46","v":{"v":0,"d":"0.0"}}]
[{"$f":"\"T\"&Barosheet!B54","v":"T17"},{"$f":"Barosheet!C54","v":{"v":0,"d":"0.0"}},{"$f":"Barosheet!D54","v":{"v":0,"d":"0.0"}},{"$f":"Barosheet!E54","v":{"v":0,"d":"0.0"}},{"$f":"Barosheet!F54","v":{"v":0,"d":"0.0"}},{"$f":"Barosheet!J54","v":{"v":0,"d":"0.0"}},{"$f":"Barosheet!K54","v":{"v":0,"d":"0.0"}},{"$f":"Barosheet!L54","v":{"v":0,"d":"0.0"}},"Tilt","T17",{"v":0,"d":"0.0"},{"v":0,"d":"0.0"},{"v":0,"d":"0.0"}]
[{"$f":"\"T\"&Barosheet!B55","v":"T18"},{"$f":"Barosheet!C55","v":{"v":0,"d":"0.0"}},{"$f":"Barosheet!D55","v":{"v":0,"d":"0.0"}},{"$f":"Barosheet!E55","v":{"v":0,"d":"0.0"}},{"$f":"Barosheet!F55","v":{"v":0,"d":"0.0"}},{"$f":"Barosheet!J55","v":{"v":0,"d":"0.0"}},{"$f":"Barosheet!K55","v":{"v":0,"d":"0.0"}},{"$f":"Barosheet!L55","v":{"v":0,"d":"0.0"}},"Tilt","T18",{"v":0,"d":"0.0"},{"v":0,"d":"0.0"},{"v":0,"d":"0.0"}]
[{"$f":"\"T\"&Barosheet!B56","v":"T19"},{"$f":"Barosheet!C56","v":{"v":0,"d":"0.0"}},{"$f":"Barosheet!D56","v":{"v":0,"d":"0.0"}},{"$f":"Barosheet!E56","v":{"v":0,"d":"0.0"}},{"$f":"Barosheet!F56","v":{"v":0,"d":"0.0"}},{"$f":"Barosheet!J56","v":{"v":0,"d":"0.0"}},{"$f":"Barosheet!K56","v":{"v":0,"d":"0.0"}},{"$f":"Barosheet!L56","v":{"v":0,"d":"0.0"}},"Tilt","T19",{"v":0,"d":"0.0"},{"v":0,"d":"0.0"},{"v":0,"d":"0.0"}]
[{"$f":"\"T\"&Barosheet!B57","v":"T20"},{"$f":"Barosheet!C57","v":{"v":0,"d":"0.0"}},{"$f":"Barosheet!D57","v":{"v":0,"d":"0.0"}},{"$f":"Barosheet!E57","v":{"v":0,"d":"0.0"}},{"$f":"Barosheet!F57","v":{"v":0,"d":"0.0"}},{"$f":"Barosheet!J57","v":{"v":0,"d":"0.0"}},{"$f":"Barosheet!K57","v":{"v":0,"d":"0.0"}},{"$f":"Barosheet!L57","v":{"v":0,"d":"0.0"}},"Tilt","T20",{"v":0,"d":"0.0"},{"v":0,"d":"0.0"},{"v":0,"d":"0.0"}]
[{"$f":"\"T\"&Barosheet!B58","v":"T21"},{"$f":"Barosheet!C58","v":{"v":0,"d":"0.0"}},{"$f":"Barosheet!D58","v":{"v":0,"d":"0.0"}},{"$f":"Barosheet!E58","v":{"v":0,"d":"0.0"}},{"$f":"Barosheet!F58","v":{"v":0,"d":"0.0"}},{"$f":"Barosheet!J58","v":{"v":0,"d":"0.0"}},{"$f":"Barosheet!K58","v":{"v":0,"d":"0.0"}},{"$f":"Barosheet!L58","v":{"v":0,"d":"0.0"}},"Tilt","T21",{"v":0,"d":"0.0"},{"v":0,"d":"0.0"},{"v":0,"d":"0.0"}]
[{"$f":"\"T\"&Barosheet!B59","v":"T22"},{"$f":"Barosheet!C59","v":{"v":0,"d":"0.0"}},{"$f":"Barosheet!D59","v":{"v":0,"d":"0.0"}},{"$f":"Barosheet!E59","v":{"v":0,"d":"0.0"}},{"$f":"Barosheet!F59","v":{"v":0,"d":"0.0"}},{"$f":"Barosheet!J59","v":{"v":0,"d":"0.0"}},{"$f":"Barosheet!K59","v":{"v":0,"d":"0.0"}},{"$f":"Barosheet!L59","v":{"v":0,"d":"0.0"}},"Tilt","T22",{"v":0,"d":"0.0"},{"v":0,"d":"0.0"},{"v":0,"d":"0.0"}]
[{"$f":"\"T\"&Barosheet!B60","v":"T23"},{"$f":"Barosheet!C60","v":{"v":0,"d":"0.0"}},{"$f":"Barosheet!D60","v":{"v":0,"d":"0.0"}},{"$f":"Barosheet!E60","v":{"v":0,"d":"0.0"}},{"$f":"Barosheet!F60","v":{"v":0,"d":"0.0"}},{"$f":"Barosheet!J60","v":{"v":0,"d":"0.0"}},{"$f":"Barosheet!K60","v":{"v":0,"d":"0.0"}},{"$f":"Barosheet!L60","v":{"v":0,"d":"0.0"}},"Tilt","T23",{"v":0,"d":"0.0"},{"v":0,"d":"0.0"},{"v":0,"d":"0.0"}]
[{"$f":"\"T\"&Barosheet!B61","v":"T24"},{"$f":"Barosheet!C61","v":{"v":0,"d":"0.0"}},{"$f":"Barosheet!D61","v":{"v":0,"d":"0.0"}},{"$f":"Barosheet!E61","v":{"v":0,"d":"0.0"}},{"$f":"Barosheet!F61","v":{"v":0,"d":"0.0"}},{"$f":"Barosheet!J61","v":{"v":0,"d":"0.0"}},{"$f":"Barosheet!K61","v":{"v":0,"d":"0.0"}},{"$f":"Barosheet!L61","v":{"v":0,"d":"0.0"}},"Tilt","T24",{"v":0,"d":"0.0"},{"v":0,"d":"0.0"},{"v":0,"d":"0.0"}]
[{"$f":"\"T\"&Barosheet!B62","v":"T25"},{"$f":"Barosheet!C62","v":{"v":0,"d":"0.0"}},{"$f":"Barosheet!D62","v":{"v":0,"d":"0.0"}},{"$f":"Barosheet!E62","v":{"v":0,"d":"0.0"}},{"$f":"Barosheet!F62","v":{"v":0,"d":"0.0"}},{"$f":"Barosheet!J62","v":{"v":0,"d":"0.0"}},{"$f":"Barosheet!K62","v":{"v":0,"d":"0.0"}},{"$f":"Barosheet!L62","v":{"v":0,"d":"0.0"}},"Tilt","T25",{"v":0,"d":"0.0"},{"v":0,"d":"0.0"},{"v":0,"d":"0.0"}]
[{"$f":"\"T\"&Barosheet!B63","v":"T26"},{"$f":"Barosheet!C63","v":{"v":0,"d":"0.0"}},{"$f":"Barosheet!D63","v":{"v":0,"d":"0.0"}},{"$f":"Barosheet!E63","v":{"v":0,"d":"0.0"}},{"$f":"Barosheet!F63","v":{"v":0,"d":"0.0"}},{"$f":"Barosheet!J63","v":{"v":0,"d":"0.0"}},{"$f":"Barosheet!K63","v":{"v":0,"d":"0.0"}},{"$f":"Barosheet!L63","v":{"v":0,"d":"0.0"}},"Tilt","T26",{"v":0,"d":"0.0"},{"v":0,"d":"0.0"},{"v":0,"d":"0.0"}]
[{"$f":"\"T\"&Barosheet!B64","v":"T27"},{"$f":"Barosheet!C64","v":{"v":0,"d":"0.0"}},{"$f":"Barosheet!D64","v":{"v":0,"d":"0.0"}},{"$f":"Barosheet!E64","v":{"v":0,"d":"0.0"}},{"$f":"Barosheet!F64","v":{"v":0,"d":"0.0"}},{"$f":"Barosheet!J64","v":{"v":0,"d":"0.0"}},{"$f":"Barosheet!K64","v":{"v":0,"d":"0.0"}},{"$f":"Barosheet!L64","v":{"v":0,"d":"0.0"}},"Tilt","T27",{"v":0,"d":"0.0"},{"v":0,"d":"0.0"},{"v":0,"d":"0.0"}]
[{"$f":"\"T\"&Barosheet!B65","v":"T28"},{"$f":"Barosheet!C65","v":{"v":0,"d":"0.0"}},{"$f":"Barosheet!D65","v":{"v":0,"d":"0.0"}},{"$f":"Barosheet!E65","v":{"v":0,"d":"0.0"}},{"$f":"Barosheet!F65","v":{"v":0,"d":"0.0"}},{"$f":"Barosheet!J65","v":{"v":0,"d":"0.0"}},{"$f":"Barosheet!K65","v":{"v":0,"d":"0.0"}},{"$f":"Barosheet!L65","v":{"v":0,"d":"0.0"}},"Tilt","T28",{"v":0,"d":"0.0"},{"v":0,"d":"0.0"},{"v":0,"d":"0.0"}]
[{"$f":"\"R\"&Barosheet!B81","v":"R1"},{"$f":"Barosheet!C81","v":{"v":0,"d":"0.0"}},{"$f":"Barosheet!D81","v":{"v":0,"d":"0.0"}},{"$f":"Barosheet!E81","v":{"v":0,"d":"0.0"}},{"$f":"Barosheet!F81","v":{"v":0,"d":"0.0"}},{"$f":"Barosheet!J81","v":{"v":0,"d":"0.0"}},{"$f":"Barosheet!K81","v":{"v":0,"d":"0.0"}},{"$f":"Barosheet!L81","v":{"v":0,"d":"0.0"}},"Return flat","R1",{"v":0,"d":"0.0"},{"v":0,"d":"0.0"},{"v":0,"d":"0.0"}]
[{"$f":"\"R\"&Barosheet!B82","v":"R2"},{"$f":"Barosheet!C82","v":{"v":0,"d":"0.0"}},{"$f":"Barosheet!D82","v":{"v":0,"d":"0.0"}},{"$f":"Barosheet!E82","v":{"v":0,"d":"0.0"}},{"$f":"Barosheet!F82","v":{"v":0,"d":"0.0"}},{"$f":"Barosheet!J82","v":{"v":0,"d":"0.0"}},{"$f":"Barosheet!K82","v":{"v":0,"d":"0.0"}},{"$f":"Barosheet!L82","v":{"v":0,"d":"0.0"}},"Return flat","R2",{"v":0,"d":"0.0"},{"v":0,"d":"0.0"},{"v":0,"d":"0.0"}]
[{"$f":"\"R\"&Barosheet!B83","v":"R3"},{"$f":"Barosheet!C83","v":{"v":0,"d":"0.0"}},{"$f":"Barosheet!D83","v":{"v":0,"d":"0.0"}},{"$f":"Barosheet!E83","v":{"v":0,"d":"0.0"}},{"$f":"Barosheet!F83","v":{"v":0,"d":"0.0"}},{"$f":"Barosheet!J83","v":{"v":0,"d":"0.0"}},{"$f":"Barosheet!K83","v":{"v":0,"d":"0.0"}},{"$f":"Barosheet!L83","v":{"v":0,"d":"0.0"}},"Return flat","R3",{"v":0,"d":"0.0"},{"v":0,"d":"0.0"},{"v":0,"d":"0.0"}]
[{"$f":"\"R\"&Barosheet!B84","v":"R4"},{"$f":"Barosheet!C84","v":{"v":0,"d":"0.0"}},{"$f":"Barosheet!D84","v":{"v":0,"d":"0.0"}},{"$f":"Barosheet!E84","v":{"v":0,"d":"0.0"}},{"$f":"Barosheet!F84","v":{"v":0,"d":"0.0"}},{"$f":"Barosheet!J84","v":{"v":0,"d":"0.0"}},{"$f":"Barosheet!K84","v":{"v":0,"d":"0.0"}},{"$f":"Barosheet!L84","v":{"v":0,"d":"0.0"}},"Return flat","R4",{"v":0,"d":"0.0"},{"v":0,"d":"0.0"},{"v":0,"d":"0.0"}]
[{"$f":"\"R\"&Barosheet!B85","v":"R5"},{"$f":"Barosheet!C85","v":{"v":0,"d":"0.0"}},{"$f":"Barosheet!D85","v":{"v":0,"d":"0.0"}},{"$f":"Barosheet!E85","v":{"v":0,"d":"0.0"}},{"$f":"Barosheet!F85","v":{"v":0,"d":"0.0"}},{"$f":"Barosheet!J85","v":{"v":0,"d":"0.0"}},{"$f":"Barosheet!K85","v":{"v":0,"d":"0.0"}},{"$f":"Barosheet!L85","v":{"v":0,"d":"0.0"}},"Return flat","R5",{"v":0,"d":"0.0"},{"v":0,"d":"0.0"},{"v":0,"d":"0.0"}]
[{"$f":"\"Sit\"&Barosheet!B87","v":"Sit1"},{"$f":"Barosheet!C87","v":{"v":0,"d":"0.0"}},{"$f":"Barosheet!D87","v":{"v":0,"d":"0.0"}},{"$f":"Barosheet!E87","v":{"v":0,"d":"0.0"}},{"$f":"Barosheet!F87","v":{"v":0,"d":"0.0"}},{"$f":"Barosheet!J87","v":{"v":0,"d":"0.0"}},{"$f":"Barosheet!K87","v":{"v":0,"d":"0.0"}},{"$f":"Barosheet!L87","v":{"v":0,"d":"0.0"}},"Sitting","Sit1",{"v":0,"d":"0.0"},{"v":0,"d":"0.0"},{"v":0,"d":"0.0"}]
[{"$f":"\"Sit\"&Barosheet!B88","v":"Sit2"},{"$f":"Barosheet!C88","v":{"v":0,"d":"0.0"}},{"$f":"Barosheet!D88","v":{"v":0,"d":"0.0"}},{"$f":"Barosheet!E88","v":{"v":0,"d":"0.0"}},{"$f":"Barosheet!F88","v":{"v":0,"d":"0.0"}},{"$f":"Barosheet!J88","v":{"v":0,"d":"0.0"}},{"$f":"Barosheet!K88","v":{"v":0,"d":"0.0"}},{"$f":"Barosheet!L88","v":{"v":0,"d":"0.0"}},"Sitting","Sit2",{"v":0,"d":"0.0"},{"v":0,"d":"0.0"},{"v":0,"d":"0.0"}]
[]
[]
["Phase means — BP & HR"]
["Metric","Supine","Tilt","Return flat","Sitting"]
["SBP",{"$f":"B5","v":{"$error":"#DIV/0!"}},{"$error":"#DIV/0!"},{"$f":"E5","v":{"$error":"#DIV/0!"}},{"$error":"#DIV/0!"}]
["DBP",{"$error":"#DIV/0!"},{"$error":"#DIV/0!"},{"$error":"#DIV/0!"},{"$error":"#DIV/0!"}]
["MBP",{"$error":"#DIV/0!"},{"$error":"#DIV/0!"},{"$error":"#DIV/0!"},{"$error":"#DIV/0!"}]
["HR",{"$error":"#DIV/0!"},{"$error":"#DIV/0!"},{"$error":"#DIV/0!"},{"$error":"#DIV/0!"}]
[]
["Phase means — PSV & M-CBF"]
["Metric","Supine","Tilt","Return flat","Sitting"]
["PSV",{"$f":"B10","v":{"$error":"#DIV/0!"}},{"$f":"C10","v":{"$error":"#DIV/0!"}},{"$f":"E10","v":{"$error":"#DIV/0!"}},{"$f":"F10","v":{"$error":"#DIV/0!"}}]
["M-CBF",{"$f":"B11","v":{"$error":"#DIV/0!"}},{"$f":"C11","v":{"$error":"#DIV/0!"}},{"$f":"E11","v":{"$error":"#DIV/0!"}},{"$f":"F11","v":{"$error":"#DIV/0!"}}]
["HRV",{"$f":"B9","v":{"$error":"#DIV/0!"}},{"$f":"C9","v":{"$error":"#DIV/0!"}},{"$f":"E9","v":{"$error":"#DIV/0!"}},{"$f":"F9","v":{"$error":"#DIV/0!"}}]

{"sheet":"Valsalva Dashboard","index":3,"n_rows":52,"n_cols":12,"rows_kept":52}
["Valsalva — sitting"]
["3 maneuvers"]
[]
["Metric","Man. 1","Man. 2","Man. 3","Mean",null,null,"Highlights",null,"Phase colors"]
["Baseline SBP",{"$f":"IF(COUNTIFS($I$14:$I$46,1,$H$14:$H$46,\"Baseline\",$B$14:$B$46,\">0\")=0,\"\",AVERAGEIFS($B$14:$B$46,$I$14:$I$46,1,$H$14:$H$46,\"Baseline\",$B$14:$B$46,\">0\"))","v":""},{"$f":"IF(COUNTIFS($I$14:$I$46,2,$H$14:$H$46,\"Baseline\",$B$14:$B$46,\">0\")=0,\"\",AVERAGEIFS($B$14:$B$46,$I$14:$I$46,2,$H$14:$H$46,\"Baseline\",$B$14:$B$46,\">0\"))","v":""},{"$f":"IF(COUNTIFS($I$14:$I$46,3,$H$14:$H$46,\"Baseline\",$B$14:$B$46,\">0\")=0,\"\",AVERAGEIFS($B$14:$B$46,$I$14:$I$46,3,$H$14:$H$46,\"Baseline\",$B$14:$B$46,\">0\"))","v":""},{"$f":"IF(COUNT(B5:D5)=0,\"\",AVERAGE(B5:D5))","v":""},null,null,"Points with SBP",{"$f":"COUNTIF(B14:B46,\">0\")","v":0},"Baseline"]
["Phase I SBP",{"$f":"IF(COUNTIFS($I$14:$I$46,1,$H$14:$H$46,\"phase I\",$B$14:$B$46,\">0\")=0,\"\",AVERAGEIFS($B$14:$B$46,$I$14:$I$46,1,$H$14:$H$46,\"phase I\",$B$14:$B$46,\">0\"))","v":""},{"$f":"IF(COUNTIFS($I$14:$I$46,2,$H$14:$H$46,\"phase I\",$B$14:$B$46,\">0\")=0,\"\",AVERAGEIFS($B$14:$B$46,$I$14:$I$46,2,$H$14:$H$46,\"phase I\",$B$14:$B$46,\">0\"))","v":""},{"$f":"IF(COUNTIFS($I$14:$I$46,3,$H$14:$H$46,\"phase I\",$B$14:$B$46,\">0\")=0,\"\",AVERAGEIFS($B$14:$B$46,$I$14:$I$46,3,$H$14:$H$46,\"phase I\",$B$14:$B$46,\">0\"))","v":""},"",null,null,"VR (mean)",{"$f":"E11","v":""},"Phase I"]
["II early SBP",{"$f":"IF(COUNTIFS($I$14:$I$46,1,$H$14:$H$46,\"phase II early\",$B$14:$B$46,\">0\")=0,\"\",AVERAGEIFS($B$14:$B$46,$I$14:$I$46,1,$H$14:$H$46,\"phase II early\",$B$14:$B$46,\">0\"))","v":""},{"$f":"IF(COUNTIFS($I$14:$I$46,2,$H$14:$H$46,\"phase II early\",$B$14:$B$46,\">0\")=0,\"\",AVERAGEIFS($B$14:$B$46,$I$14:$I$46,2,$H$14:$H$46,\"phase II early\",$B$14:$B$46,\">0\"))","v":""},{"$f":"IF(COUNTIFS($I$14:$I$46,3,$H$14:$H$46,\"phase II early\",$B$14:$B$46,\">0\")=0,\"\",AVERAGEIFS($B$14:$B$46,$I$14:$I$46,3,$H$14:$H$46,\"phase II early\",$B$14:$B$46,\">0\"))","v":""},"",null,null,"Normal VR ≥ 1.21",null,"II early"]
["II late SBP",{"$f":"IF(COUNTIFS($I$14:$I$46,1,$H$14:$H$46,\"phase II late\",$B$14:$B$46,\">0\")=0,\"\",AVERAGEIFS($B$14:$B$46,$I$14:$I$46,1,$H$14:$H$46,\"phase II late\",$B$14:$B$46,\">0\"))","v":""},{"$f":"IF(COUNTIFS($I$14:$I$46,2,$H$14:$H$46,\"phase II late\",$B$14:$B$46,\">0\")=0,\"\",AVERAGEIFS($B$14:$B$46,$I$14:$I$46,2,$H$14:$H$46,\"phase II late\",$B$14:$B$46,\">0\"))","v":""},{"$f":"IF(COUNTIFS($I$14:$I$46,3,$H$14:$H$46,\"phase II late\",$B$14:$B$46,\">0\")=0,\"\",AVERAGEIFS($B$14:$B$46,$I$14:$I$46,3,$H$14:$H$46,\"phase II late\",$B$14:$B$46,\">0\"))","v":""},"",null,null,"Green = live formula",null,"II late"]
["IV overshoot SBP",{"$f":"IF(COUNTIFS($I$14:$I$46,1,$H$14:$H$46,\"phase IV (overshoot)\",$B$14:$B$46,\">0\")=0,\"\",AVERAGEIFS($B$14:$B$46,$I$14:$I$46,1,$H$14:$H$46,\"phase IV (overshoot)\",$B$14:$B$46,\">0\"))","v":""},{"$f":"IF(COUNTIFS($I$14:$I$46,2,$H$14:$H$46,\"phase IV (overshoot)\",$B$14:$B$46,\">0\")=0,\"\",AVERAGEIFS($B$14:$B$46,$I$14:$I$46,2,$H$14:$H$46,\"phase IV (overshoot)\",$B$14:$B$46,\">0\"))","v":""},{"$f":"IF(COUNTIFS($I$14:$I$46,3,$H$14:$H$46,\"phase IV (overshoot)\",$B$14:$B$46,\">0\")=0,\"\",AVERAGEIFS($B$14:$B$46,$I$14:$I$46,3,$H$14:$H$46,\"phase IV (overshoot)\",$B$14:$B$46,\">0\"))","v":""},"",{"$nulls":4},"IV overshoot"]
["SBP overshoot",{"$f":"IF(OR(B9=\"\",B5=\"\"),\"\",B9-B5)","v":""},{"$f":"IF(OR(C9=\"\",C5=\"\"),\"\",C9-C5)","v":""},{"$f":"IF(OR(D9=\"\",D5=\"\"),\"\",D9-D5)","v":""},""]
["Valsalva ratio",{"$f":"IF(COUNTIFS($I$14:$I$46,1,$H$14:$H$46,\"phase II*\",$D$14:$D$46,\">0\")*COUNTIFS($I$14:$I$46,1,$H$14:$H$46,\"phase IV*\",$D$14:$D$46,\">0\")=0,\"\",_xlfn.MAXIFS($D$14:$D$46,$I$14:$I$46,1,$H$14:$H$46,\"phase II*\",$D$14:$D$46,\">0\")/_xlfn.MINIFS($D$14:$D$46,$I$14:$I$46,1,$H$14:$H$46,\"phase IV*\",$D$14:$D$46,\">0\"))","v":""},{"$f":"IF(COUNTIFS($I$14:$I$46,2,$H$14:$H$46,\"phase II*\",$D$14:$D$46,\">0\")*COUNTIFS($I$14:$I$46,2,$H$14:$H$46,\"phase IV*\",$D$14:$D$46,\">0\")=0,\"\",_xlfn.MAXIFS($D$14:$D$46,$I$14:$I$46,2,$H$14:$H$46,\"phase II*\",$D$14:$D$46,\">0\")/_xlfn.MINIFS($D$14:$D$46,$I$14:$I$46,2,$H$14:$H$46,\"phase IV*\",$D$14:$D$46,\">0\"))","v":""},{"$f":"IF(COUNTIFS($I$14:$I$46,3,$H$14:$H$46,\"phase II*\",$D$14:$D$46,\">0\")*COUNTIFS($I$14:$I$46,3,$H$14:$H$46,\"phase IV*\",$D$14:$D$46,\">0\")=0,\"\",_xlfn.MAXIFS($D$14:$D$46,$I$14:$I$46,3,$H$14:$H$46,\"phase II*\",$D$14:$D$46,\">0\")/_xlfn.MINIFS($D$14:$D$46,$I$14:$I$46,3,$H$14:$H$46,\"phase IV*\",$D$14:$D$46,\">0\"))","v":""},""]
[]
["Seconds","SBP","DBP","HR","HRV","PSV","M-CBF","Phase","Man.",null,"Seconds","HRV"]
[{"$f":"IF(Barosheet!T98=\"\",\"\",Barosheet!T98)","v":10},{"$nulls":4},{"$f":"IF(Barosheet!Y98=\"\",\"\",Barosheet!Y98)","v":""},{"$f":"IF(Barosheet!Z98=\"\",\"\",Barosheet!Z98)","v":""},{"$f":"IF(Barosheet!S98=\"\",\"\",TRIM(Barosheet!S98))","v":""},1,null,{"$f":"A14","v":10},{"$f":"IF(N(E14)<=0,\"\",E14)","v":""}]
[{"$f":"IF(Barosheet!T99=\"\",\"\",Barosheet!T99)","v":20},{"$nulls":4},{"$f":"IF(Barosheet!Y99=\"\",\"\",Barosheet!Y99)","v":""},{"$f":"IF(Barosheet!Z99=\"\",\"\",Barosheet!Z99)","v":""},{"$f":"IF(Barosheet!S99=\"\",\"\",TRIM(Barosheet!S99))","v":""},1,null,20,""]
[{"$f":"IF(Barosheet!T100=\"\",\"\",Barosheet!T100)","v":30},{"$nulls":4},{"$f":"IF(Barosheet!Y100=\"\",\"\",Barosheet!Y100)","v":""},{"$f":"IF(Barosheet!Z100=\"\",\"\",Barosheet!Z100)","v":""},{"$f":"IF(Barosheet!S100=\"\",\"\",TRIM(Barosheet!S100))","v":""},1,null,30,""]
[{"$f":"IF(Barosheet!T101=\"\",\"\",Barosheet!T101)","v":40},{"$nulls":4},{"$f":"IF(Barosheet!Y101=\"\",\"\",Barosheet!Y101)","v":""},{"$f":"IF(Barosheet!Z101=\"\",\"\",Barosheet!Z101)","v":""},{"$f":"IF(Barosheet!S101=\"\",\"\",TRIM(Barosheet!S101))","v":""},1,null,40,""]
[{"$f":"IF(Barosheet!T102=\"\",\"\",Barosheet!T102)","v":50},{"$nulls":4},{"$f":"IF(Barosheet!Y102=\"\",\"\",Barosheet!Y102)","v":""},{"$f":"IF(Barosheet!Z102=\"\",\"\",Barosheet!Z102)","v":""},{"$f":"IF(Barosheet!S102=\"\",\"\",TRIM(Barosheet!S102))","v":"Baseline"},1,null,50,""]
[{"$f":"IF(Barosheet!T103=\"\",\"\",Barosheet!T103)","v":60},{"$nulls":4},{"$f":"IF(Barosheet!Y103=\"\",\"\",Barosheet!Y103)","v":""},{"$f":"IF(Barosheet!Z103=\"\",\"\",Barosheet!Z103)","v":""},{"$f":"IF(Barosheet!S103=\"\",\"\",TRIM(Barosheet!S103))","v":"phase I"},1,null,60,""]
[{"$f":"IF(Barosheet!T104=\"\",\"\",Barosheet!T104)","v":70},{"$nulls":4},{"$f":"IF(Barosheet!Y104=\"\",\"\",Barosheet!Y104)","v":""},{"$f":"IF(Barosheet!Z104=\"\",\"\",Barosheet!Z104)","v":""},{"$f":"IF(Barosheet!S104=\"\",\"\",TRIM(Barosheet!S104))","v":"phase II early"},1,null,70,""]
[{"$f":"IF(Barosheet!T105=\"\",\"\",Barosheet!T105)","v":80},{"$nulls":4},{"$f":"IF(Barosheet!Y105=\"\",\"\",Barosheet!Y105)","v":""},{"$f":"IF(Barosheet!Z105=\"\",\"\",Barosheet!Z105)","v":""},{"$f":"IF(Barosheet!S105=\"\",\"\",TRIM(Barosheet!S105))","v":"phase II late"},1,null,80,""]
[{"$f":"IF(Barosheet!T106=\"\",\"\",Barosheet!T106)","v":90},{"$nulls":4},{"$f":"IF(Barosheet!Y106=\"\",\"\",Barosheet!Y106)","v":""},{"$f":"IF(Barosheet!Z106=\"\",\"\",Barosheet!Z106)","v":""},{"$f":"IF(Barosheet!S106=\"\",\"\",TRIM(Barosheet!S106))","v":"phase IV (overshoot)"},1,null,90,""]
[{"$f":"IF(Barosheet!T107=\"\",\"\",Barosheet!T107)","v":100},{"$nulls":4},{"$f":"IF(Barosheet!Y107=\"\",\"\",Barosheet!Y107)","v":""},{"$f":"IF(Barosheet!Z107=\"\",\"\",Barosheet!Z107)","v":""},{"$f":"IF(Barosheet!S107=\"\",\"\",TRIM(Barosheet!S107))","v":""},1,null,100,""]
[{"$f":"IF(Barosheet!T108=\"\",\"\",Barosheet!T108)","v":110},{"$nulls":4},{"$f":"IF(Barosheet!Y108=\"\",\"\",Barosheet!Y108)","v":""},{"$f":"IF(Barosheet!Z108=\"\",\"\",Barosheet!Z108)","v":""},{"$f":"IF(Barosheet!S108=\"\",\"\",TRIM(Barosheet!S108))","v":""},1,null,110,""]
[{"$f":"IF(Barosheet!T109=\"\",\"\",Barosheet!T109)","v":120},{"$nulls":4},{"$f":"IF(Barosheet!Y109=\"\",\"\",Barosheet!Y109)","v":""},{"$f":"IF(Barosheet!Z109=\"\",\"\",Barosheet!Z109)","v":""},{"$f":"IF(Barosheet!S109=\"\",\"\",TRIM(Barosheet!S109))","v":""},1,null,120,""]
[{"$f":"IF(Barosheet!T110=\"\",\"\",Barosheet!T110)","v":130},{"$nulls":4},{"$f":"IF(Barosheet!Y110=\"\",\"\",Barosheet!Y110)","v":""},{"$f":"IF(Barosheet!Z110=\"\",\"\",Barosheet!Z110)","v":""},{"$f":"IF(Barosheet!S110=\"\",\"\",TRIM(Barosheet!S110))","v":""},1,null,130,""]
[{"$f":"IF(Barosheet!T111=\"\",\"\",Barosheet!T111)","v":140},{"$nulls":4},{"$f":"IF(Barosheet!Y111=\"\",\"\",Barosheet!Y111)","v":""},{"$f":"IF(Barosheet!Z111=\"\",\"\",Barosheet!Z111)","v":""},{"$f":"IF(Barosheet!S111=\"\",\"\",TRIM(Barosheet!S111))","v":"Baseline"},2,null,140,""]
[{"$f":"IF(Barosheet!T112=\"\",\"\",Barosheet!T112)","v":150},{"$nulls":4},{"$f":"IF(Barosheet!Y112=\"\",\"\",Barosheet!Y112)","v":""},{"$f":"IF(Barosheet!Z112=\"\",\"\",Barosheet!Z112)","v":""},{"$f":"IF(Barosheet!S112=\"\",\"\",TRIM(Barosheet!S112))","v":"phase I"},2,null,150,""]
[{"$f":"IF(Barosheet!T113=\"\",\"\",Barosheet!T113)","v":160},{"$nulls":4},{"$f":"IF(Barosheet!Y113=\"\",\"\",Barosheet!Y113)","v":""},{"$f":"IF(Barosheet!Z113=\"\",\"\",Barosheet!Z113)","v":""},{"$f":"IF(Barosheet!S113=\"\",\"\",TRIM(Barosheet!S113))","v":"phase II early"},2,null,160,""]
[{"$f":"IF(Barosheet!T114=\"\",\"\",Barosheet!T114)","v":170},{"$nulls":4},{"$f":"IF(Barosheet!Y114=\"\",\"\",Barosheet!Y114)","v":""},{"$f":"IF(Barosheet!Z114=\"\",\"\",Barosheet!Z114)","v":""},{"$f":"IF(Barosheet!S114=\"\",\"\",TRIM(Barosheet!S114))","v":"phase II late"},2,null,170,""]
[{"$f":"IF(Barosheet!T115=\"\",\"\",Barosheet!T115)","v":180},{"$nulls":4},{"$f":"IF(Barosheet!Y115=\"\",\"\",Barosheet!Y115)","v":""},{"$f":"IF(Barosheet!Z115=\"\",\"\",Barosheet!Z115)","v":""},{"$f":"IF(Barosheet!S115=\"\",\"\",TRIM(Barosheet!S115))","v":"phase IV (overshoot)"},2,null,180,""]
[{"$f":"IF(Barosheet!T116=\"\",\"\",Barosheet!T116)","v":190},{"$nulls":4},{"$f":"IF(Barosheet!Y116=\"\",\"\",Barosheet!Y116)","v":""},{"$f":"IF(Barosheet!Z116=\"\",\"\",Barosheet!Z116)","v":""},{"$f":"IF(Barosheet!S116=\"\",\"\",TRIM(Barosheet!S116))","v":""},2,null,190,""]
[{"$f":"IF(Barosheet!T117=\"\",\"\",Barosheet!T117)","v":200},{"$nulls":4},{"$f":"IF(Barosheet!Y117=\"\",\"\",Barosheet!Y117)","v":""},{"$f":"IF(Barosheet!Z117=\"\",\"\",Barosheet!Z117)","v":""},{"$f":"IF(Barosheet!S117=\"\",\"\",TRIM(Barosheet!S117))","v":""},2,null,200,""]
[{"$f":"IF(Barosheet!T118=\"\",\"\",Barosheet!T118)","v":210},{"$nulls":4},{"$f":"IF(Barosheet!Y118=\"\",\"\",Barosheet!Y118)","v":""},{"$f":"IF(Barosheet!Z118=\"\",\"\",Barosheet!Z118)","v":""},{"$f":"IF(Barosheet!S118=\"\",\"\",TRIM(Barosheet!S118))","v":""},2,null,210,""]
[{"$f":"IF(Barosheet!T119=\"\",\"\",Barosheet!T119)","v":220},{"$nulls":4},{"$f":"IF(Barosheet!Y119=\"\",\"\",Barosheet!Y119)","v":""},{"$f":"IF(Barosheet!Z119=\"\",\"\",Barosheet!Z119)","v":""},{"$f":"IF(Barosheet!S119=\"\",\"\",TRIM(Barosheet!S119))","v":""},2,null,220,""]
[{"$f":"IF(Barosheet!T120=\"\",\"\",Barosheet!T120)","v":230},{"$nulls":4},{"$f":"IF(Barosheet!Y120=\"\",\"\",Barosheet!Y120)","v":""},{"$f":"IF(Barosheet!Z120=\"\",\"\",Barosheet!Z120)","v":""},{"$f":"IF(Barosheet!S120=\"\",\"\",TRIM(Barosheet!S120))","v":"Baseline"},3,null,230,""]
[{"$f":"IF(Barosheet!T121=\"\",\"\",Barosheet!T121)","v":240},{"$nulls":4},{"$f":"IF(Barosheet!Y121=\"\",\"\",Barosheet!Y121)","v":""},{"$f":"IF(Barosheet!Z121=\"\",\"\",Barosheet!Z121)","v":""},{"$f":"IF(Barosheet!S121=\"\",\"\",TRIM(Barosheet!S121))","v":"phase I"},3,null,240,""]
[{"$f":"IF(Barosheet!T122=\"\",\"\",Barosheet!T122)","v":250},{"$nulls":4},{"$f":"IF(Barosheet!Y122=\"\",\"\",Barosheet!Y122)","v":""},{"$f":"IF(Barosheet!Z122=\"\",\"\",Barosheet!Z122)","v":""},{"$f":"IF(Barosheet!S122=\"\",\"\",TRIM(Barosheet!S122))","v":"phase II early"},3,null,250,""]
[{"$f":"IF(Barosheet!T123=\"\",\"\",Barosheet!T123)","v":260},{"$nulls":4},{"$f":"IF(Barosheet!Y123=\"\",\"\",Barosheet!Y123)","v":""},{"$f":"IF(Barosheet!Z123=\"\",\"\",Barosheet!Z123)","v":""},{"$f":"IF(Barosheet!S123=\"\",\"\",TRIM(Barosheet!S123))","v":"phase II late"},3,null,260,""]
[{"$f":"IF(Barosheet!T124=\"\",\"\",Barosheet!T124)","v":270},{"$nulls":4},{"$f":"IF(Barosheet!Y124=\"\",\"\",Barosheet!Y124)","v":""},{"$f":"IF(Barosheet!Z124=\"\",\"\",Barosheet!Z124)","v":""},{"$f":"IF(Barosheet!S124=\"\",\"\",TRIM(Barosheet!S124))","v":"phase IV (overshoot)"},3,null,270,""]
[{"$f":"IF(Barosheet!T125=\"\",\"\",Barosheet!T125)","v":280},{"$nulls":4},{"$f":"IF(Barosheet!Y125=\"\",\"\",Barosheet!Y125)","v":""},{"$f":"IF(Barosheet!Z125=\"\",\"\",Barosheet!Z125)","v":""},{"$f":"IF(Barosheet!S125=\"\",\"\",TRIM(Barosheet!S125))","v":""},3,null,280,""]
[{"$f":"IF(Barosheet!T126=\"\",\"\",Barosheet!T126)","v":290},{"$nulls":4},{"$f":"IF(Barosheet!Y126=\"\",\"\",Barosheet!Y126)","v":""},{"$f":"IF(Barosheet!Z126=\"\",\"\",Barosheet!Z126)","v":""},{"$f":"IF(Barosheet!S126=\"\",\"\",TRIM(Barosheet!S126))","v":""},3,null,290,""]
[{"$f":"IF(Barosheet!T127=\"\",\"\",Barosheet!T127)","v":300},{"$nulls":4},{"$f":"IF(Barosheet!Y127=\"\",\"\",Barosheet!Y127)","v":""},{"$f":"IF(Barosheet!Z127=\"\",\"\",Barosheet!Z127)","v":""},{"$f":"IF(Barosheet!S127=\"\",\"\",TRIM(Barosheet!S127))","v":""},3,null,300,""]
[{"$f":"IF(Barosheet!T128=\"\",\"\",Barosheet!T128)","v":310},{"$nulls":4},{"$f":"IF(Barosheet!Y128=\"\",\"\",Barosheet!Y128)","v":""},{"$f":"IF(Barosheet!Z128=\"\",\"\",Barosheet!Z128)","v":""},{"$f":"IF(Barosheet!S128=\"\",\"\",TRIM(Barosheet!S128))","v":""},3,null,310,""]
[{"$f":"IF(Barosheet!T129=\"\",\"\",Barosheet!T129)","v":320},{"$nulls":4},{"$f":"IF(Barosheet!Y129=\"\",\"\",Barosheet!Y129)","v":""},{"$f":"IF(Barosheet!Z129=\"\",\"\",Barosheet!Z129)","v":""},{"$f":"IF(Barosheet!S129=\"\",\"\",TRIM(Barosheet!S129))","v":""},3,null,320,""]
[{"$f":"IF(Barosheet!T130=\"\",\"\",Barosheet!T130)","v":330},{"$nulls":4},{"$f":"IF(Barosheet!Y130=\"\",\"\",Barosheet!Y130)","v":""},{"$f":"IF(Barosheet!Z130=\"\",\"\",Barosheet!Z130)","v":""},{"$f":"IF(Barosheet!S130=\"\",\"\",TRIM(Barosheet!S130))","v":""},3,null,330,""]
[]
["Phase means"]
["Metric","Baseline","Phase I","II early","II late","IV overshoot"]
["SBP",{"$f":"IF(COUNTIFS($H$14:$H$46,\"Baseline\",$B$14:$B$46,\">0\")=0,\"\",AVERAGEIFS($B$14:$B$46,$H$14:$H$46,\"Baseline\",$B$14:$B$46,\">0\"))","v":""},{"$f":"IF(COUNTIFS($H$14:$H$46,\"phase I\",$B$14:$B$46,\">0\")=0,\"\",AVERAGEIFS($B$14:$B$46,$H$14:$H$46,\"phase I\",$B$14:$B$46,\">0\"))","v":""},{"$f":"IF(COUNTIFS($H$14:$H$46,\"phase II early\",$B$14:$B$46,\">0\")=0,\"\",AVERAGEIFS($B$14:$B$46,$H$14:$H$46,\"phase II early\",$B$14:$B$46,\">0\"))","v":""},{"$f":"IF(COUNTIFS($H$14:$H$46,\"phase II late\",$B$14:$B$46,\">0\")=0,\"\",AVERAGEIFS($B$14:$B$46,$H$14:$H$46,\"phase II late\",$B$14:$B$46,\">0\"))","v":""},{"$f":"IF(COUNTIFS($H$14:$H$46,\"phase IV (overshoot)\",$B$14:$B$46,\">0\")=0,\"\",AVERAGEIFS($B$14:$B$46,$H$14:$H$46,\"phase IV (overshoot)\",$B$14:$B$46,\">0\"))","v":""}]
["DBP",{"$f":"IF(COUNTIFS($H$14:$H$46,\"Baseline\",$C$14:$C$46,\">0\")=0,\"\",AVERAGEIFS($C$14:$C$46,$H$14:$H$46,\"Baseline\",$C$14:$C$46,\">0\"))","v":""},{"$f":"IF(COUNTIFS($H$14:$H$46,\"phase I\",$C$14:$C$46,\">0\")=0,\"\",AVERAGEIFS($C$14:$C$46,$H$14:$H$46,\"phase I\",$C$14:$C$46,\">0\"))","v":""},{"$f":"IF(COUNTIFS($H$14:$H$46,\"phase II early\",$C$14:$C$46,\">0\")=0,\"\",AVERAGEIFS($C$14:$C$46,$H$14:$H$46,\"phase II early\",$C$14:$C$46,\">0\"))","v":""},{"$f":"IF(COUNTIFS($H$14:$H$46,\"phase II late\",$C$14:$C$46,\">0\")=0,\"\",AVERAGEIFS($C$14:$C$46,$H$14:$H$46,\"phase II late\",$C$14:$C$46,\">0\"))","v":""},{"$f":"IF(COUNTIFS($H$14:$H$46,\"phase IV (overshoot)\",$C$14:$C$46,\">0\")=0,\"\",AVERAGEIFS($C$14:$C$46,$H$14:$H$46,\"phase IV (overshoot)\",$C$14:$C$46,\">0\"))","v":""}]
["HR",{"$f":"IF(COUNTIFS($H$14:$H$46,\"Baseline\",$D$14:$D$46,\">0\")=0,\"\",AVERAGEIFS($D$14:$D$46,$H$14:$H$46,\"Baseline\",$D$14:$D$46,\">0\"))","v":""},{"$f":"IF(COUNTIFS($H$14:$H$46,\"phase I\",$D$14:$D$46,\">0\")=0,\"\",AVERAGEIFS($D$14:$D$46,$H$14:$H$46,\"phase I\",$D$14:$D$46,\">0\"))","v":""},{"$f":"IF(COUNTIFS($H$14:$H$46,\"phase II early\",$D$14:$D$46,\">0\")=0,\"\",AVERAGEIFS($D$14:$D$46,$H$14:$H$46,\"phase II early\",$D$14:$D$46,\">0\"))","v":""},{"$f":"IF(COUNTIFS($H$14:$H$46,\"phase II late\",$D$14:$D$46,\">0\")=0,\"\",AVERAGEIFS($D$14:$D$46,$H$14:$H$46,\"phase II late\",$D$14:$D$46,\">0\"))","v":""},{"$f":"IF(COUNTIFS($H$14:$H$46,\"phase IV (overshoot)\",$D$14:$D$46,\">0\")=0,\"\",AVERAGEIFS($D$14:$D$46,$H$14:$H$46,\"phase IV (overshoot)\",$D$14:$D$46,\">0\"))","v":""}]